Target
Dipeptidyl peptidase 4
Ligand
BDBM11464
Substrate
Meas. Tech.
ChEMBL_53365 (CHEMBL664535)
Ki
126±n/a nM
Citation
 Senten, KVan der Veken, PDe Meester, ILambeir, AMScharpé, SHaemers, AAugustyns, K Design, synthesis, and SAR of potent and selective dipeptide-derived inhibitors for dipeptidyl peptidases. J Med Chem 46:5005-14 (2003)  
Target
Name:
Dipeptidyl peptidase 4
Synonyms:
ADABP Adenosine deaminase complexing protein 2 CD_antigen=CD26 DPP4 DPPIV Dipeptidyl peptidase 4 (DPP IV) Dipeptidyl peptidase 4 (DPP4) Dipeptidyl peptidase 4 membrane form Dipeptidyl peptidase IV Dipeptidyl peptidase IV (DDP-IV) Dipeptidyl peptidase IV membrane form Dipeptidyl peptidase-IV (DPP-4) T-cell activation antigen CD26 | TP103
Type:
Enzyme
Mol. Mass.:
88271.01
Organism:
Homo sapiens (Human)
Description:
P27487
Residue:
766
  
Inhibitor
Name:
BDBM11464
Synonyms:
(2S,3S)-2-amino-3-methyl-1-(1,3-thiazolidin-3-yl)pentan-1-one CHEMBL98408 thiazolidide 2
Type:
Small organic molecule
Emp. Form.:
C9H18N2OS
Mol. Mass.:
202.317
SMILES:
CC[C@H](C)[C@H](N)C(=O)N1CCSC1
: