Target
Dipeptidyl peptidase 2
Ligand
BDBM50135044
Substrate
Meas. Tech.
ChEMBL_53367 (CHEMBL666613)
IC50
1150±n/a nM
Citation
 Senten, KVan der Veken, PDe Meester, ILambeir, AMScharpé, SHaemers, AAugustyns, K Design, synthesis, and SAR of potent and selective dipeptide-derived inhibitors for dipeptidyl peptidases. J Med Chem 46:5005-14 (2003)  
Target
Name:
Dipeptidyl peptidase 2
Synonyms:
DAP II DPP2_HUMAN Dipeptidyl aminopeptidase II Dipeptidyl peptidase 2 (DPP2) Dipeptidyl peptidase II (DPP II) Dipeptidyl peptidase II and dipeptidyl peptidase IV (DPP2 and DPP4) carboxytripeptidase dipeptidyl(amino)peptidase II | dipeptidylarylamidase
Type:
Protein
Mol. Mass.:
54339.29
Organism:
Homo sapiens (Human)
Description:
Q9UHL4
Residue:
492
  
Inhibitor
Name:
BDBM50135044
Synonyms:
2,4-Diamino-1-piperidin-1-yl-butan-1-one | CHEMBL147923
Type:
Small organic molecule
Emp. Form.:
C9H19N3O
Mol. Mass.:
185.2667
SMILES:
NCCC(N)C(=O)N1CCCCC1
: