Target
Histone deacetylase 1
Ligand
BDBM50114823
Substrate
Meas. Tech.
ChEMBL_87858 (CHEMBL701996)
IC50
8±n/a nM
Citation
 Miller, TAWitter, DJBelvedere, S Histone deacetylase inhibitors. J Med Chem 46:5097-116 (2003)  
Target
Name:
Histone deacetylase 1
Synonyms:
Cereblon/Histone deacetylase 1 HDAC1 Histone deacetylase 1 (HDAC1) RPD3L1
Type:
Enzyme
Mol. Mass.:
55090.27
Organism:
Homo sapiens (Human)
Description:
Q13547
Residue:
482
  
Inhibitor
Name:
BDBM50114823
Synonyms:
8-Naphthalen-2-yl-non-8-enoic acid hydroxyamide N-hydroxy-8-(naphthalen-2-yl)non-8-enamide
Type:
Small organic molecule
Emp. Form.:
C19H23NO2
Mol. Mass.:
297.3914
SMILES:
ONC(=O)CCCCCCC(=C)c1ccc2ccccc2c1
: