Target
Nitric oxide synthase, brain
Ligand
BDBM50136949
Substrate
Meas. Tech.
ChEMBL_143519 (CHEMBL755132)
Ki
74±n/a nM
Citation
 Ji, HLi, HFlinspach, MPoulos, TLSilverman, RB Computer modeling of selective regions in the active site of nitric oxide synthases: implication for the design of isoform-selective inhibitors. J Med Chem 46:5700-11 (2003)  
Target
Name:
Nitric oxide synthase, brain
Synonyms:
Nitric Oxide Synthase, brain
Type:
Mol. Mass.:
Description:
ASSAY_ID of EBI is 143519
Components:
This complex has 2 components.
Component 1
Name:
Nitric oxide synthase, brain
Synonyms:
Constitutive NOS NC-NOS NOS type I nNOS NOS1_HUMAN Neuronal nitric oxide synthase Nitric oxide synthase, neuronal (nNOS) bNOS | nNOS
Type:
Homodimer
Mol. Mass.:
160985.98
Organism:
Homo sapiens (Human)
Description:
P29475
Residue:
1434
  
Component 2
Name:
Nitric oxide synthase, brain
Synonyms:
Bnos NC-NOS NOS type I nNOS Neuronal nitric oxide synthase Nitric Oxide Synthase, brain Nitric oxide synthase, brain (nNOS) Nitric-oxide synthase, brain (nNOS) Nos1 | Peptidyl-cysteine S-nitrosylase NOS1
Type:
Enzyme
Mol. Mass.:
160570.98
Organism:
Rattus norvegicus (rat)
Description:
Recombinant nNOS overexpressed in E. coli was used in enzyme assays.
Residue:
1429
  
Inhibitor
Name:
BDBM50136949
Synonyms:
(4R)-4-[((2S)-2-amino-5-{[(Z)-imino(nitroamino)methyl]amino}pentanoyl)amino]pyrrolidine-2-carboxamide CHEMBL357485
Type:
Small organic molecule
Emp. Form.:
C11H22N8O4
Mol. Mass.:
330.3436
SMILES:
N[C@@H](CCCNC(=N)N[N+]([O-])=O)C(=O)NC1CNC(C1)C(N)=O
: