Target
Nitric oxide synthase, inducible
Ligand
BDBM21960
Substrate
Meas. Tech.
ChEMBL_89334 (CHEMBL702709)
Ki
73000±n/a nM
Citation
 Ji, HLi, HFlinspach, MPoulos, TLSilverman, RB Computer modeling of selective regions in the active site of nitric oxide synthases: implication for the design of isoform-selective inhibitors. J Med Chem 46:5700-11 (2003)  
Target
Name:
Nitric oxide synthase, inducible
Synonyms:
Nitric Oxide Synthase, inducible
Type:
Mol. Mass.:
Description:
ASSAY_ID of EBI is 89334
Components:
This complex has 2 components.
Component 1
Name:
Nitric oxide synthase, inducible
Synonyms:
Inducible NO synthase Inducible nitric oxide synthase (iNOS) MAC-NOS NOS type II Nitric Oxide Synthase, inducible Nos2
Type:
Enzyme
Mol. Mass.:
130595.79
Organism:
Mus musculus (mouse)
Description:
Recombinant enzyme overexpressed in E. coli.
Residue:
1144
  
Component 2
Name:
Nitric oxide synthase, inducible
Synonyms:
HEP-NOS Inducible NO synthase NOS type II NOS2A Nitric oxide synthase, inducible (iNOS) | iNOS
Type:
Homodimer
Mol. Mass.:
131141.95
Organism:
Homo sapiens (Human)
Description:
P35228
Residue:
1153
  
Inhibitor
Name:
BDBM21960
Synonyms:
3-[(4S)-4-amino-5-[(2-aminoethyl)amino]pentyl]-1-nitroguanidine JMC522060 Compound 2 | N omega-Nitro-L-Arginine-Containing Dipeptide, 1
Type:
Emp. Form.:
C8H21N7O2
Mol. Mass.:
247.298
SMILES:
NCCNC[C@@H](N)CCCN=C(N)N[N+]([O-])=O
: