Target
Nitric oxide synthase, endothelial
Ligand
BDBM50136953
Substrate
Meas. Tech.
ChEMBL_65147 (CHEMBL679288)
Ki
314000±n/a nM
Citation
 Ji, HLi, HFlinspach, MPoulos, TLSilverman, RB Computer modeling of selective regions in the active site of nitric oxide synthases: implication for the design of isoform-selective inhibitors. J Med Chem 46:5700-11 (2003)  
Target
Name:
Nitric oxide synthase, endothelial
Synonyms:
Nitric Oxide Synthase, endothelial
Type:
Mol. Mass.:
Description:
ASSAY_ID of EBI is 65147
Components:
This complex has 2 components.
Component 1
Name:
Nitric oxide synthase, endothelial
Synonyms:
Constitutive NOS Endothelial NOS NOS type III NOS3_HUMAN Nitric oxide synthase (inducible and endothelial) Nitric-oxide synthase (endothelial and brain) eNOS
Type:
Enzyme Catalytic Domain
Mol. Mass.:
133297.84
Organism:
Homo sapiens (Human)
Description:
P29474
Residue:
1203
  
Component 2
Name:
Nitric oxide synthase, endothelial
Synonyms:
Constitutive NOS Endothelial nitric oxide synthase NOS type III NOS3_BOVIN Nitric-oxide synthase, endothelial | cNOS
Type:
Enzyme
Mol. Mass.:
133292.26
Organism:
Bos taurus (bovine)
Description:
Recombinant eNOS overexpressed in E. coli was used in enzyme assays.
Residue:
1205
  
Inhibitor
Name:
BDBM50136953
Synonyms:
CHEMBL152583 | N-{(4S)-4-amino-5-[(aminomethyl)amino]pentyl}-N'-nitroguanidine
Type:
Small organic molecule
Emp. Form.:
C7H19N7O2
Mol. Mass.:
233.2715
SMILES:
NCNC[C@@H](N)CCCNC(=N)N[N+]([O-])=O
: