Target
Nitric oxide synthase, endothelial
Ligand
BDBM50030279
Substrate
Meas. Tech.
ChEMBL_65297 (CHEMBL873599)
IC50
330±n/a nM
Citation
 Tinker, ACBeaton, HGBoughton-Smith, NCook, TRCooper, SLFraser-Rae, LHallam, KHamley, PMcInally, TNicholls, DJPimm, ADWallace, AV 1,2-Dihydro-4-quinazolinamines: potent, highly selective inhibitors of inducible nitric oxide synthase which show antiinflammatory activity in vivo. J Med Chem 46:913-6 (2003)  
Target
Name:
Nitric oxide synthase, endothelial
Synonyms:
Constitutive NOS Endothelial NOS NOS type III NOS3_HUMAN Nitric oxide synthase (inducible and endothelial) Nitric-oxide synthase (endothelial and brain) eNOS
Type:
Enzyme Catalytic Domain
Mol. Mass.:
133297.84
Organism:
Homo sapiens (Human)
Description:
P29474
Residue:
1203
  
Inhibitor
Name:
BDBM50030279
Synonyms:
2-Amino-5-(N'-methyl-guanidino)-pentanoic acid | CHEMBL312870
Type:
Small organic molecule
Emp. Form.:
C7H16N4O2
Mol. Mass.:
188.2275
SMILES:
CNC(=N)NCCCC(N)C(O)=O
: