Target
Prothrombin
Ligand
BDBM50125874
Substrate
Meas. Tech.
ChEMBL_207987 (CHEMBL816070)
IC50
6000±n/a nM
Citation
 Thorstensson, FKvarnström, IMusil, DNilsson, ISamuelsson, B Synthesis of novel thrombin inhibitors. Use of ring-closing metathesis reactions for synthesis of P2 cyclopentene- and cyclohexenedicarboxylic acid derivatives. J Med Chem 46:1165-79 (2003)  
Target
Name:
Prothrombin
Synonyms:
Activation peptide fragment 1 Coagulation factor II Prothrombin precursor Thrombin heavy chain | Thrombin light chain
Type:
Protein
Mol. Mass.:
70029.57
Organism:
Homo sapiens (Human)
Description:
P00734
Residue:
622
  
Inhibitor
Name:
BDBM50125874
Synonyms:
2-(Piperidine-1-carbonyl)-cyclopent-2-enecarboxylic acid 4-carbamimidoyl-benzylamide | CHEMBL278238
Type:
Small organic molecule
Emp. Form.:
C20H26N4O2
Mol. Mass.:
354.446
SMILES:
NC(=N)c1ccc(CNC(=O)C2CCC=C2C(=O)N2CCCCC2)cc1
: