Target
Sodium-dependent dopamine transporter
Ligand
BDBM50125902
Substrate
Meas. Tech.
ChEMBL_61844 (CHEMBL879861)
IC50
0.46±n/a nM
Citation
 Ghorai, SKCook, CDavis, MVenkataraman, SKGeorge, CBeardsley, PMReith, MEDutta, AK High affinity hydroxypiperidine analogues of 4-(2-benzhydryloxyethyl)-1-(4-fluorobenzyl)piperidine for the dopamine transporter: stereospecific interactions in vitro and in vivo. J Med Chem 46:1220-8 (2003)  
Target
Name:
Sodium-dependent dopamine transporter
Synonyms:
DA transporter SC6A3_RAT Sodium-dependent dopamine transporter | Sodium-dependent dopamine transporter (DAT)
Type:
Multi-pass membrane protein
Mol. Mass.:
68749.45
Organism:
Rattus norvegicus (rat)
Description:
P23977
Residue:
619
  
Inhibitor
Name:
BDBM50125902
Synonyms:
(1S,4R)-4-(2-Benzhydryloxy-ethyl)-1-(4-fluoro-benzyl)-piperidin-3-ol | CHEMBL21213
Type:
Small organic molecule
Emp. Form.:
C27H30FNO2
Mol. Mass.:
419.531
SMILES:
OC1CN(Cc2ccc(F)cc2)CC[C@@H]1CCOC(c1ccccc1)c1ccccc1
: