Target
Gamma-aminobutyric acid receptor subunit alpha-1/beta-2/gamma-2
Ligand
BDBM50125935
Substrate
Meas. Tech.
ChEMBL_69477 (CHEMBL685376)
EC50
64000±n/a nM
Citation
 Husain, SSZiebell, MRRuesch, DHong, FArevalo, EKosterlitz, JAOlsen, RWForman, SACohen, JBMiller, KW 2-(3-Methyl-3H-diaziren-3-yl)ethyl 1-(1-phenylethyl)-1H-imidazole-5-carboxylate: a derivative of the stereoselective general anesthetic etomidate for photolabeling ligand-gated ion channels. J Med Chem 46:1257-65 (2003)  
Target
Name:
Gamma-aminobutyric acid receptor subunit alpha-1/beta-2/gamma-2
Synonyms:
GABA receptor alpha-1/beta-2/gamma-2 subunit | GABA-A receptor; alpha-1/beta-2/gamma-2
Type:
Protein
Mol. Mass.:
Description:
Components:
This complex has 3 components.
Component 1
Name:
Gamma-aminobutyric acid receptor subunit alpha-1
Synonyms:
Benzodiazepine central GABA A Benzodiazepine liver GABA(A) receptor subunit alpha-1 GABA-A receptor GBRA1_HUMAN TBPS | agonist GABA site
Type:
Protein
Mol. Mass.:
51817.35
Organism:
Homo sapiens (Human)
Description:
P14867
Residue:
456
  
Component 2
Name:
Gamma-aminobutyric acid receptor subunit beta-2
Synonyms:
GABA(A) receptor subunit beta-2 GBRB2_HUMAN
Type:
PROTEIN
Mol. Mass.:
59167.91
Organism:
Homo sapiens (Human)
Description:
EBI_221
Residue:
512
  
Component 3
Name:
Gamma-aminobutyric acid receptor subunit gamma-2
Synonyms:
GABA(A) receptor subunit gamma-2 GBRG2_HUMAN
Type:
PROTEIN
Mol. Mass.:
54172.74
Organism:
Homo sapiens (Human)
Description:
EBI_217
Residue:
467
  
Inhibitor
Name:
BDBM50125935
Synonyms:
(R)-1-(1-phenylethyl)-1H-imidazole-5-carboxylic acid ethyl ester 3-((R)-1-Phenyl-ethyl)-3H-imidazole-4-carboxylic acid ethyl ester CHEMBL681 R(+)-etomidate | R-ETOMIDATE
Type:
Small organic molecule
Emp. Form.:
C14H16N2O2
Mol. Mass.:
244.289
SMILES:
CCOC(=O)c1cncn1[C@H](C)c1ccccc1
: