Target
ATP-dependent translocase ABCB1
Ligand
BDBM13775
Substrate
Meas. Tech.
ChEMBL_148001 (CHEMBL754159)
IC50
>50000±n/a nM
Citation
 Schwab, DFischer, HTabatabaei, APoli, SHuwyler, J Comparison of in vitro P-glycoprotein screening assays: recommendations for their use in drug discovery. J Med Chem 46:1716-25 (2003)  
Target
Name:
ATP-dependent translocase ABCB1
Synonyms:
ATP-binding cassette sub-family B member 1 Abcb1b MDR1B_MOUSE Mdr1b P-glycoprotein 1 Pgy1 | Pgy1-1
Type:
PROTEIN
Mol. Mass.:
141009.67
Organism:
Mus musculus
Description:
ChEMBL_474396
Residue:
1276
  
Inhibitor
Name:
BDBM13775
Synonyms:
(1S,2R,10S,11S,14R,15S,17S)-14,17-dihydroxy-14-(2-hydroxyacetyl)-2,15-dimethyltetracyclo[8.7.0.0^{2,7}.0^{11,15}]heptadec-6-en-5-one 3H-cortisol US10188667, Example 00023 cortisol
Type:
Steroid
Emp. Form.:
C21H30O5
Mol. Mass.:
362.4599
SMILES:
[H][C@@]12CC[C@](O)(C(=O)CO)[C@@]1(C)C[C@H](O)[C@@]1([H])[C@@]2([H])CCC2=CC(=O)CC[C@]12C
: