Target
ATP-dependent translocase ABCB1
Ligand
BDBM50127138
Substrate
Meas. Tech.
ChEMBL_148000 (CHEMBL755828)
IC50
200±n/a nM
Citation
 Schwab, DFischer, HTabatabaei, APoli, SHuwyler, J Comparison of in vitro P-glycoprotein screening assays: recommendations for their use in drug discovery. J Med Chem 46:1716-25 (2003)  
Target
Name:
ATP-dependent translocase ABCB1
Synonyms:
Abcb1a MDR1A_MOUSE Mdr3 P-glycoprotein 1 and 3 (MDR1a/MDR1b) Pgy-3 | Pgy3
Type:
Protein
Mol. Mass.:
140669.02
Organism:
Mus musculus (Mouse)
Description:
P21447
Residue:
1276
  
Inhibitor
Name:
BDBM50127138
Synonyms:
2-(butan-2-yl)-4-{4-[4-(4-{[(2R,4S)-2-(2,4-dichlorophenyl)-2-(1H-1,2,4-triazol-1-ylmethyl)-1,3-dioxolan-4-yl]methoxy}phenyl)piperazin-1-yl]phenyl}-2,4-dihydro-3H-1,2,4-triazol-3-one ITRACONAZOLE Oriconazole | Sporanox (TN)
Type:
Small organic molecule
Emp. Form.:
C35H38Cl2N8O4
Mol. Mass.:
705.633
SMILES:
CCC(C)n1ncn(-c2ccc(cc2)N2CCN(CC2)c2ccc(OC[C@H]3CO[C@@](Cn4cncn4)(O3)c3ccc(Cl)cc3Cl)cc2)c1=O
: