Target
ATP-dependent translocase ABCB1
Ligand
BDBM24226
Substrate
Meas. Tech.
ChEMBL_148001 (CHEMBL754159)
IC50
1700±n/a nM
Citation
 Schwab, DFischer, HTabatabaei, APoli, SHuwyler, J Comparison of in vitro P-glycoprotein screening assays: recommendations for their use in drug discovery. J Med Chem 46:1716-25 (2003)  
Target
Name:
ATP-dependent translocase ABCB1
Synonyms:
ATP-binding cassette sub-family B member 1 Abcb1b MDR1B_MOUSE Mdr1b P-glycoprotein 1 Pgy1 | Pgy1-1
Type:
PROTEIN
Mol. Mass.:
141009.67
Organism:
Mus musculus
Description:
ChEMBL_474396
Residue:
1276
  
Inhibitor
Name:
BDBM24226
Synonyms:
1-[(4-fluorophenyl)methyl]-N-{1-[2-(4-methoxyphenyl)ethyl]piperidin-4-yl}-1H-1,3-benzodiazol-2-amine Astemizole, [O-Methyl-3H] Hismanal [3H]-ASTEMIZOLE cid_2247 | med.21724, Compound Astemizole
Type:
Radiolabeled ligand
Emp. Form.:
C28H31FN4O
Mol. Mass.:
458.5703
SMILES:
COc1ccc(CCN2CCC(CC2)Nc2nc3ccccc3n2Cc2ccc(F)cc2)cc1
: