Target
Dipeptidyl peptidase 4
Ligand
BDBM50146008
Substrate
Meas. Tech.
ChEMBL_53378 (CHEMBL665782)
Ki
10000±n/a nM
Citation
 Magnin, DRRobl, JASulsky, RBAugeri, DJHuang, YSimpkins, LMTaunk, PCBetebenner, DARobertson, JGAbboa-Offei, BEWang, ACap, MXin, LTao, LSitkoff, DFMalley, MFGougoutas, JZKhanna, AHuang, QHan, SPParker, RAHamann, LG Synthesis of novel potent dipeptidyl peptidase IV inhibitors with enhanced chemical stability: interplay between the N-terminal amino acid alkyl side chain and the cyclopropyl group of alpha-aminoacyl-l-cis-4,5-methanoprolinenitrile-based inhibitors. J Med Chem 47:2587-98 (2004)  
Target
Name:
Dipeptidyl peptidase 4
Synonyms:
CD26 DPP IV DPP4_PIG Dipeptidyl peptidase 4 membrane form Dipeptidyl peptidase IV Dipeptidyl peptidase IV soluble form | T-cell activation antigen CD26
Type:
Enzyme
Mol. Mass.:
88235.21
Organism:
Sus scrofa (pig)
Description:
Residue:
766
  
Inhibitor
Name:
BDBM50146008
Synonyms:
(1S,5S)-2-(Piperidine-2-carbonyl)-2-aza-bicyclo[3.1.0]hexane-3-carbonitrile; TFA | CHEMBL89273
Type:
Small organic molecule
Emp. Form.:
C12H17N3O
Mol. Mass.:
219.2829
SMILES:
O=C(C1CCCCN1)N1[C@H]2C[C@H]2CC1C#N
: