Target
B2 bradykinin receptor
Ligand
BDBM50067289
Substrate
Meas. Tech.
ChEMBL_40291 (CHEMBL653423)
IC50
4.2±n/a nM
Citation
 Sawada, YKayakiri, HAbe, YMizutani, TInamura, NAsano, MHatori, CAramori, IOku, TTanaka, H Discovery of the first non-peptide full agonists for the human bradykinin B(2) receptor incorporating 4-(2-picolyloxy)quinoline and 1-(2-picolyl)benzimidazole frameworks. J Med Chem 47:2853-63 (2004)  
Target
Name:
B2 bradykinin receptor
Synonyms:
B2 BRADYKININ B2R BK-2 receptor BKRB2_HUMAN | Bradykinin B2 receptor
Type:
Enzyme Catalytic Domain
Mol. Mass.:
44467.17
Organism:
Homo sapiens (Human)
Description:
B2 BRADYKININ BDKRB2 HUMAN::P30411
Residue:
391
  
Inhibitor
Name:
BDBM50067289
Synonyms:
(E)-3-(6-Acetylamino-pyridin-3-yl)-N-({[2,4-dichloro-3-(2-methoxy-1-methyl-1H-benzoimidazol-4-yloxymethyl)-phenyl]-methyl-carbamoyl}-methyl)-acrylamide | CHEMBL264751
Type:
Small organic molecule
Emp. Form.:
C29H28Cl2N6O5
Mol. Mass.:
611.476
SMILES:
COc1nc2c(OCc3c(Cl)ccc(N(C)C(=O)CNC(=O)\C=C\c4ccc(NC(C)=O)nc4)c3Cl)cccc2n1C
: