Target
B2 bradykinin receptor
Ligand
BDBM50146903
Substrate
Meas. Tech.
ChEMBL_40291 (CHEMBL653423)
IC50
0.56±n/a nM
Citation
 Sawada, YKayakiri, HAbe, YMizutani, TInamura, NAsano, MHatori, CAramori, IOku, TTanaka, H Discovery of the first non-peptide full agonists for the human bradykinin B(2) receptor incorporating 4-(2-picolyloxy)quinoline and 1-(2-picolyl)benzimidazole frameworks. J Med Chem 47:2853-63 (2004)  
Target
Name:
B2 bradykinin receptor
Synonyms:
B2 BRADYKININ B2R BK-2 receptor BKRB2_HUMAN | Bradykinin B2 receptor
Type:
Enzyme Catalytic Domain
Mol. Mass.:
44467.17
Organism:
Homo sapiens (Human)
Description:
B2 BRADYKININ BDKRB2 HUMAN::P30411
Residue:
391
  
Inhibitor
Name:
BDBM50146903
Synonyms:
CHEMBL98460 | N-[4-((E)-2-{[({2,4-Dichloro-3-[2-methyl-4-(pyridin-2-ylmethoxy)-quinolin-8-yloxymethyl]-phenyl}-methyl-carbamoyl)-methyl]-carbamoyl}-vinyl)-phenyl]-isonicotinamide
Type:
Small organic molecule
Emp. Form.:
C41H34Cl2N6O5
Mol. Mass.:
761.652
SMILES:
CN(C(=O)CNC(=O)\C=C\c1ccc(NC(=O)c2ccncc2)cc1)c1ccc(Cl)c(COc2cccc3c(OCc4ccccn4)cc(C)nc23)c1Cl
: