Target
Tyrosine-protein phosphatase non-receptor type 1
Ligand
BDBM50149218
Substrate
Meas. Tech.
ChEMBL_162587 (CHEMBL768528)
Kd
>1000000±n/a nM
Citation
 Erlanson, DAMcDowell, RSO'Brien, T Fragment-based drug discovery. J Med Chem 47:3463-82 (2004)  
Target
Name:
Tyrosine-protein phosphatase non-receptor type 1
Synonyms:
PTN1_HUMAN PTPN1 Protein tyrosine phosphatase-1B (PTP1B) Protein-tyrosine phosphatase 1B (PTP1B) Tyrosine-protein phosphatase non-receptor type 1 (PTP1B)
Type:
Protein phosphatase
Mol. Mass.:
49963.76
Organism:
Homo sapiens (Human)
Description:
Human recombinant GST-fusion PTP1B (1-435).
Residue:
435
  
Inhibitor
Name:
BDBM50149218
Synonyms:
Benzo[b]thiophene-2-carboxylic acid | CHEMBL312607
Type:
Small organic molecule
Emp. Form.:
C9H6O2S
Mol. Mass.:
178.208
SMILES:
OC(=O)c1cc2ccccc2s1
: