Target
Tyrosine-protein phosphatase non-receptor type 1
Ligand
BDBM13951
Substrate
Meas. Tech.
ChEMBL_162587 (CHEMBL768528)
Kd
100000±n/a nM
Citation
 Erlanson, DAMcDowell, RSO'Brien, T Fragment-based drug discovery. J Med Chem 47:3463-82 (2004)  
Target
Name:
Tyrosine-protein phosphatase non-receptor type 1
Synonyms:
PTN1_HUMAN PTPN1 Protein tyrosine phosphatase-1B (PTP1B) Protein-tyrosine phosphatase 1B (PTP1B) Tyrosine-protein phosphatase non-receptor type 1 (PTP1B)
Type:
Protein phosphatase
Mol. Mass.:
49963.76
Organism:
Homo sapiens (Human)
Description:
Human recombinant GST-fusion PTP1B (1-435).
Residue:
435
  
Inhibitor
Name:
BDBM13951
Synonyms:
2-[(2,3-Dimethylphenyl)oxalylamino]benzoic acid CHEMBL65459 oxalyl-aryl-amino benzoic acid-based inhibitor 1
Type:
Small organic molecule
Emp. Form.:
C17H15NO5
Mol. Mass.:
313.3047
SMILES:
Cc1cccc(N(C(=O)C(O)=O)c2ccccc2C(O)=O)c1C
: