Target
D(4) dopamine receptor
Ligand
BDBM50150141
Substrate
Meas. Tech.
ChEMBL_61323 (CHEMBL670098)
Ki
1.5±n/a nM
Citation
 Cowart, MLatshaw, SPBhatia, PDaanen, JFRohde, JNelson, SLPatel, MKolasa, TNakane, MUchic, MEMiller, LNTerranova, MAChang, RDonnelly-Roberts, DLNamovic, MTHollingsworth, PRMartino, BRLynch, JJSullivan, JPHsieh, GCMoreland, RBBrioni, JDStewart, AO Discovery of 2-(4-pyridin-2-ylpiperazin-1-ylmethyl)-1H-benzimidazole (ABT-724), a dopaminergic agent with a novel mode of action for the potential treatment of erectile dysfunction. J Med Chem 47:3853-64 (2004)  
Target
Name:
D(4) dopamine receptor
Synonyms:
D(2C) dopamine receptor DOPAMINE D4.2 DRD4 Dopamine D4 receptor
Type:
Enzyme
Mol. Mass.:
48373.19
Organism:
Homo sapiens (Human)
Description:
P21917
Residue:
419
  
Inhibitor
Name:
BDBM50150141
Synonyms:
2-[4-(3,4-Dimethyl-phenyl)-piperazin-1-ylmethyl]-1H-benzoimidazole | CHEMBL127257
Type:
Small organic molecule
Emp. Form.:
C20H24N4
Mol. Mass.:
320.4314
SMILES:
Cc1ccc(cc1C)N1CCN(Cc2nc3ccccc3[nH]2)CC1
: