Target
Cytochrome P450 2C9
Ligand
BDBM50409896
Substrate
Meas. Tech.
ChEMBL_51556 (CHEMBL661229)
Ki
140000±n/a nM
Citation
 Afzelius, LZamora, IMasimirembwa, CMKarlén, AAndersson, TBMecucci, SBaroni, MCruciani, G Conformer- and alignment-independent model for predicting structurally diverse competitive CYP2C9 inhibitors. J Med Chem 47:907-14 (2004)  
Target
Name:
Cytochrome P450 2C9
Synonyms:
(R)-limonene 6-monooxygenase CP2C9_HUMAN CYP2C9 Cytochrome P450 2C9 (CYP2C9 ) P-450MP P450 PB-1 | S-mephenytoin 4-hydroxylase
Type:
Enzyme
Mol. Mass.:
55636.33
Organism:
Homo sapiens (Human)
Description:
P11712
Residue:
490
  
Inhibitor
Name:
BDBM50409896
Synonyms:
CHEMBL2110247
Type:
Small organic molecule
Emp. Form.:
C17H17N3O5S
Mol. Mass.:
375.399
SMILES:
COC(=O)c1ccc2nc([nH]c2c1)[S@](=O)Cc1nccc(OC)c1OC
: