Target
Adenylate cyclase type 5
Ligand
BDBM14487
Substrate
Meas. Tech.
ChEMBL_31714 (CHEMBL645374)
IC50
>300000±n/a nM
Citation
 Ye, SRezende, MMDeng, WPHerbert, BDaly, JWJohnson, RAKirk, KL Synthesis of 2',5'-dideoxy-2-fluoroadenosine and 2',5'-dideoxy-2,5'-difluoroadenosine: potent P-site inhibitors of adenylyl cyclase. J Med Chem 47:1207-13 (2004)  
Target
Name:
Adenylate cyclase type 5
Synonyms:
ADCY5_RAT Adcy5 Adenylate cyclase type IX Adenylyl cyclase 5
Type:
PROTEIN
Mol. Mass.:
139188.88
Organism:
Rattus norvegicus
Description:
ChEMBL_31725
Residue:
1262
  
Inhibitor
Name:
BDBM14487
Synonyms:
(2R,3R,4S,5R)-2-(6-amino-9H-purin-9-yl)-5-(hydroxymethyl)oxolane-3,4-diol Adenosine N6-Methylado cid_191 | cid_60961
Type:
Nucleoside or nucleotide
Emp. Form.:
C10H13N5O4
Mol. Mass.:
267.2413
SMILES:
Nc1ncnc2n(cnc12)[C@@H]1O[C@H](CO)[C@@H](O)[C@H]1O
: