Target
Potassium voltage-gated channel subfamily KQT member 1
Ligand
BDBM50099582
Substrate
Meas. Tech.
ChEMBL_88893 (CHEMBL694796)
IC50
120±n/a nM
Citation
 Wermuth, CG Selective optimization of side activities: another way for drug discovery. J Med Chem 47:1303-14 (2004)  
Target
Name:
Potassium voltage-gated channel subfamily KQT member 1
Synonyms:
IKs producing slow voltage-gated potassium channel subunit alpha KvLQT1 KCNQ1_CAVPO KVLQT1 Voltage-gated potassium channel subunit Kv7.1
Type:
PROTEIN
Mol. Mass.:
74450.11
Organism:
Cavia porcellus
Description:
ChEMBL_88894
Residue:
671
  
Inhibitor
Name:
BDBM50099582
Synonyms:
(3R,4S)N-[3-Hydroxy-2,2-dimethyl-6-(4,4,4-trifluoro-butoxy)-chroman-4-yl]-N-methyl-methanesulfonamide N-[(3R,4S)-3-Hydroxy-2,2-dimethyl-6-(4,4,4-trifluoro-butoxy)-chroman-4-yl]-N-methyl-methanesulfonamide | N-[3-Hydroxy-2,2-dimethyl-6-(4,4,4-trifluoro-butoxy)-chroman-4-yl]-N-methyl-methanesulfonamide
Type:
Small organic molecule
Emp. Form.:
C17H24F3NO5S
Mol. Mass.:
411.436
SMILES:
CN([C@@H]1[C@@H](O)C(C)(C)Oc2ccc(OCCCC(F)(F)F)cc12)S(C)(=O)=O
: