Target
Sodium channel protein type 4 subunit alpha
Ligand
BDBM50031299
Substrate
Meas. Tech.
ChEMBL_202570 (CHEMBL805351)
Ki
17000±n/a nM
Citation
 Yang, JGharagozloo, PYao, JIlyin, VICarter, RBNguyen, PRobledo, SWoodward, RMHogenkamp, DJ 3-(4-phenoxyphenyl)pyrazoles: a novel class of sodium channel blockers. J Med Chem 47:1547-52 (2004)  
Target
Name:
Sodium channel protein type 4 subunit alpha
Synonyms:
SCN4A SkM1 Sodium channel protein skeletal muscle subunit alpha Sodium channel protein type IV alpha subunit Voltage-gated sodium channel subunit alpha Nav1.4 | Voltage-gated sodium channel subunit alpha Nav1.4 (Nav1.4)
Type:
Protein
Mol. Mass.:
208010.01
Organism:
Homo sapiens (Human)
Description:
P35499
Residue:
1836
  
Inhibitor
Name:
BDBM50031299
Synonyms:
6-(2,3-Dichloro-phenyl)-[1,2,4]triazine-3,5-diamine 6-(2,3-dichlorophenyl)-1,2,4-triazine-3,5-diamine CHEMBL741 Lamictal | Lamictal cd
Type:
Small organic molecule
Emp. Form.:
C9H7Cl2N5
Mol. Mass.:
256.091
SMILES:
Nc1nnc(c(N)n1)-c1cccc(Cl)c1Cl
: