Target
B2 bradykinin receptor
Ligand
BDBM50067295
Substrate
Meas. Tech.
ChEMBL_40272 (CHEMBL656507)
IC50
1.3±n/a nM
Citation
 Sawada, YKayakiri, HAbe, YImai, KMizutani, TInamura, NAsano, MAramori, IHatori, CKatayama, AOku, TTanaka, H A new series of highly potent non-peptide bradykinin B2 receptor antagonists incorporating the 4-heteroarylquinoline framework. Improvement of aqueous solubility and new insights into species difference. J Med Chem 47:1617-30 (2004)  
Target
Name:
B2 bradykinin receptor
Synonyms:
B2 BRADYKININ B2R BK-2 receptor BKRB2_HUMAN | Bradykinin B2 receptor
Type:
Enzyme Catalytic Domain
Mol. Mass.:
44467.17
Organism:
Homo sapiens (Human)
Description:
B2 BRADYKININ BDKRB2 HUMAN::P30411
Residue:
391
  
Inhibitor
Name:
BDBM50067295
Synonyms:
4-{(E)-2-[({[2,4-Dichloro-3-(2-methyl-quinolin-8-yloxymethyl)-phenyl]-methyl-carbamoyl}-methyl)-carbamoyl]-vinyl}-N,N-dimethyl-benzamide; hydrochloride | CHEMBL552986
Type:
Small organic molecule
Emp. Form.:
C32H30Cl2N4O4
Mol. Mass.:
605.511
SMILES:
CN(C)C(=O)c1ccc(\C=C\C(=O)NCC(=O)N(C)c2ccc(Cl)c(COc3cccc4ccc(C)nc34)c2Cl)cc1
: