Target
Gag-Pol polyprotein [489-587]
Ligand
BDBM13929
Substrate
Meas. Tech.
ChEMBL_157865 (CHEMBL764753)
Ki
4±n/a nM
Citation
 Reid, RCPattenden, LKTyndall, JDMartin, JLWalsh, TFairlie, DP Countering cooperative effects in protease inhibitors using constrained beta-strand-mimicking templates in focused combinatorial libraries. J Med Chem 47:1641-51 (2004)  
Target
Name:
Gag-Pol polyprotein [489-587]
Synonyms:
Human immunodeficiency virus type 1 protease Pol polyprotein | gag-pol
Type:
Enzyme Subunit
Mol. Mass.:
10781.16
Organism:
Human immunodeficiency virus type 1
Description:
P04585[489-587]
Residue:
99
  
Inhibitor
Name:
BDBM13929
Synonyms:
(2R)-2-[(8S,11S)-6,9-dioxo-8-(propan-2-yl)-2-oxa-7,10-diazabicyclo[11.2.2]heptadeca-1(15),13,16-trien-11-yl]-2-hydroxy-N-(3-methylbutyl)-N-phenylethane-1-sulfonamido Macrocyclic Peptidomimetic Inhibitor 3
Type:
Small organic molecule
Emp. Form.:
C30H43N3O6S
Mol. Mass.:
573.744
SMILES:
CC(C)CCN(C[C@@H](O)[C@@H]1Cc2ccc(OCCCC(=O)N[C@@H](C(C)C)C(=O)N1)cc2)S(=O)(=O)c1ccccc1
: