Target
Fibroblast growth factor 2
Ligand
BDBM50103242
Substrate
Meas. Tech.
ChEMBL_70638 (CHEMBL678694)
Kd
223000±n/a nM
Citation
 Bytheway, ICochran, S Validation of molecular docking calculations involving FGF-1 and FGF-2. J Med Chem 47:1683-93 (2004)  
Target
Name:
Fibroblast growth factor 2
Synonyms:
Basic fibroblast growth factor FGF2 FGFB Fibroblast growth factor receptor 2 (FGF-2) Heparin-binding growth factor 2
Type:
Protein
Mol. Mass.:
30803.89
Organism:
Homo sapiens (Human)
Description:
P09038
Residue:
288
  
Inhibitor
Name:
BDBM50103242
Synonyms:
CHEMBL316894 naphthalene-1,3,6-trisulfonate(3-) | trisodium naphthalene-1,3,6-trisulfonate
Type:
Small organic molecule
Emp. Form.:
C10H5O9S3
Mol. Mass.:
365.338
SMILES:
[O-]S(=O)(=O)c1ccc2c(cc(cc2c1)S([O-])(=O)=O)S([O-])(=O)=O
: