Target
Motilin receptor
Ligand
BDBM50344952
Substrate
Meas. Tech.
ChEMBL_122661 (CHEMBL732791)
EC50
4.2±n/a nM
Citation
 Li, JJChao, HGWang, HTino, JALawrence, RMEwing, WRMa, ZYan, MSlusarchyk, DSeethala, RSun, HLi, DBurford, NTStoffel, RHSalyan, MELi, CYWitkus, MZhao, NRich, AGordon, DA Discovery of a potent and novel motilin agonist. J Med Chem 47:1704-8 (2004)  
Target
Name:
Motilin receptor
Synonyms:
G-protein coupled receptor 38 MLNR MTLR1 | MTLR_HUMAN
Type:
PROTEIN
Mol. Mass.:
45365.95
Organism:
Homo sapiens (Human)
Description:
ChEMBL_122664
Residue:
412
  
Inhibitor
Name:
BDBM50344952
Synonyms:
(2R,3S,4R,5R,8R,9S,10S,11R,12S)-5-ethyl-11-((2S,3R,4S,6R)-4-(ethyl(methyl)amino)-3-hydroxy-6-methyltetrahydro-2H-pyran-2-yloxy)-3-hydroxy-9-((2S,4S,6S)-4-methoxy-4,6-dimethyltetrahydro-2H-pyran-2-yloxy)-2,4,8,10,12,14-hexamethyl-6,15-dioxabicyclo[10.2.1]pentadec-1(14)-en-7-one ABT-229 | CHEMBL1628277
Type:
Small organic molecule
Emp. Form.:
C38H67NO10
Mol. Mass.:
697.9393
SMILES:
CC[C@H]1OC(=O)[C@H](C)[C@@H](O[C@H]2C[C@](C)(C[C@@H](C)O2)OC)[C@H](C)[C@@H](O[C@@H]2O[C@H](C)C[C@@H]([C@H]2O)N(C)CC)[C@@]2(C)CC(C)=C(O2)[C@H](C)[C@@H](O)[C@H]1C
: