Target
Translocator protein
Ligand
BDBM50143222
Substrate
Meas. Tech.
ChEMBL_37506 (CHEMBL648136)
Ki
33±n/a nM
Citation
 Primofiore, GDa Settimo, FTaliani, SSimorini, FPatrizi, MPNovellino, EGreco, GAbignente, ECosta, BChelli, BMartini, C N,N-dialkyl-2-phenylindol-3-ylglyoxylamides. A new class of potent and selective ligands at the peripheral benzodiazepine receptor. J Med Chem 47:1852-5 (2004)  
Target
Name:
Translocator protein
Synonyms:
Benzodiazepine receptors; peripheral & central Mbr PBR Peripheral benzodiazepine receptor (PBR) TSPO_RAT | Tspo
Type:
Mitochondrion membrane protein
Mol. Mass.:
18945.84
Organism:
Rattus norvegicus (rat)
Description:
Competitive binding experiments were performed on rat kidney mitochondrial membranes.
Residue:
169
  
Inhibitor
Name:
BDBM50143222
Synonyms:
1-Azepan-1-yl-2-(2-phenyl-1H-indol-3-yl)-ethane-1,2-dione | CHEMBL54740
Type:
Small organic molecule
Emp. Form.:
C22H22N2O2
Mol. Mass.:
346.4223
SMILES:
O=C(N1CCCCCC1)C(=O)c1c([nH]c2ccccc12)-c1ccccc1
: