Target
Translocator protein
Ligand
BDBM50143238
Substrate
Meas. Tech.
ChEMBL_37506 (CHEMBL648136)
Ki
5.8±n/a nM
Citation
 Primofiore, GDa Settimo, FTaliani, SSimorini, FPatrizi, MPNovellino, EGreco, GAbignente, ECosta, BChelli, BMartini, C N,N-dialkyl-2-phenylindol-3-ylglyoxylamides. A new class of potent and selective ligands at the peripheral benzodiazepine receptor. J Med Chem 47:1852-5 (2004)  
Target
Name:
Translocator protein
Synonyms:
Benzodiazepine receptors; peripheral & central Mbr PBR Peripheral benzodiazepine receptor (PBR) TSPO_RAT | Tspo
Type:
Mitochondrion membrane protein
Mol. Mass.:
18945.84
Organism:
Rattus norvegicus (rat)
Description:
Competitive binding experiments were performed on rat kidney mitochondrial membranes.
Residue:
169
  
Inhibitor
Name:
BDBM50143238
Synonyms:
2-[5-Chloro-2-(4-chloro-phenyl)-1H-indol-3-yl]-N,N-dihexyl-2-oxo-acetamide | CHEMBL53259
Type:
Small organic molecule
Emp. Form.:
C28H34Cl2N2O2
Mol. Mass.:
501.488
SMILES:
CCCCCCN(CCCCCC)C(=O)C(=O)c1c([nH]c2ccc(Cl)cc12)-c1ccc(Cl)cc1
: