Target
Endothelin-1 receptor
Ligand
BDBM50143798
Substrate
Meas. Tech.
ChEMBL_63358 (CHEMBL679122)
IC50
1.47±n/a nM
Citation
 Wu, CDecker, ERBlok, NBui, HYou, TJWang, JBourgoyne, ARKnowles, VBerens, KLHolland, GWBrock, TADixon, RA Discovery, modeling, and human pharmacokinetics of N-(2-acetyl-4,6-dimethylphenyl)-3-(3,4-dimethylisoxazol-5-ylsulfamoyl)thiophene-2-carboxamide (TBC3711), a second generation, ETA selective, and orally bioavailable endothelin antagonist. J Med Chem 47:1969-86 (2004)  
Target
Name:
Endothelin-1 receptor
Synonyms:
EDNRA_RAT Ednra Endothelin-1 receptor
Type:
Enzyme Catalytic Domain
Mol. Mass.:
48256.91
Organism:
RAT
Description:
ENDOTHELIN A EDNRA RAT::P26684
Residue:
426
  
Inhibitor
Name:
BDBM50143798
Synonyms:
3-(4-Chloro-3-methyl-isoxazol-5-ylsulfamoyl)-thiophene-2-carboxylic acid (3,5-dimethyl-biphenyl-2-yl)-amide | CHEMBL58058
Type:
Small organic molecule
Emp. Form.:
C23H20ClN3O4S2
Mol. Mass.:
502.006
SMILES:
Cc1noc(NS(=O)(=O)c2ccsc2C(=O)Nc2c(C)cc(C)cc2-c2ccccc2)c1Cl
: