Target
RNA-directed RNA polymerase
Ligand
BDBM50144938
Substrate
Meas. Tech.
ChEMBL_84042 (CHEMBL691888)
EC50
>50000±n/a nM
Citation
 Eldrup, ABAllerson, CRBennett, CFBera, SBhat, BBhat, NBosserman, MRBrooks, JBurlein, CCarroll, SSCook, PDGetty, KLMacCoss, MMcMasters, DROlsen, DBPrakash, TPPrhavc, MSong, QTomassini, JEXia, J Structure-activity relationship of purine ribonucleosides for inhibition of hepatitis C virus RNA-dependent RNA polymerase. J Med Chem 47:2283-95 (2004)  
Target
Name:
RNA-directed RNA polymerase
Synonyms:
Hepatitis C virus NS5B RNA-dependent RNA polymerase | NS5B protein
Type:
Protein
Mol. Mass.:
25173.95
Organism:
Hepatitis C virus
Description:
Q8JXU8
Residue:
229
  
Inhibitor
Name:
BDBM50144938
Synonyms:
2-Amino-9-((2R,3S,4S,5R)-4-fluoro-3-hydroxy-5-hydroxymethyl-tetrahydro-furan-2-yl)-1,9-dihydro-purin-6-one | CHEMBL420751
Type:
Small organic molecule
Emp. Form.:
C10H12FN5O4
Mol. Mass.:
285.2318
SMILES:
Nc1nc2n(cnc2c(=O)[nH]1)[C@@H]1O[C@H](CO)[C@@H](F)[C@H]1O
: