Target
Vasopressin V2 receptor
Ligand
BDBM50145118
Substrate
Meas. Tech.
ChEMBL_214721 (CHEMBL817921)
Ki
1.2±n/a nM
Citation
 Cheng, LLStoev, SManning, MDerick, SPena, AMimoun, MBGuillon, G Design of potent and selective agonists for the human vasopressin V1b receptor based on modifications of [deamino-cys1]arginine vasopressin at position 4. J Med Chem 47:2375-88 (2004)  
Target
Name:
Vasopressin V2 receptor
Synonyms:
ADHR AVPR2 DIR Renal-type arginine vasopressin receptor V2R_HUMAN Vasopressin V2 receptor | Vasopressin receptor
Type:
Receptor
Mol. Mass.:
40295.28
Organism:
Homo sapiens (Human)
Description:
P30518
Residue:
371
  
Inhibitor
Name:
BDBM50145118
Synonyms:
CHEMBL412353 | d[Val4]AVP
Type:
Small organic molecule
Emp. Form.:
C46H65N13O11S2
Mol. Mass.:
1040.219
SMILES:
CC(C)[C@@H]1NC(=O)[C@@H](Cc2ccccc2)NC(=O)[C@H](Cc2ccc(O)cc2)NC(=O)CCSSC[C@@H](NC(=O)[C@@H](CC(N)=O)NC1=O)C(=O)N1CCC[C@@H]1C(=O)N[C@@H](CCCNC(N)=N)C(=O)NCC(N)=O
: