Target
Thymidine kinase, cytosolic
Ligand
BDBM50135091
Substrate
Meas. Tech.
ChEMBL_208002 (CHEMBL816084)
Ki
16100±n/a nM
Citation
 Russ, PSchelling, PScapozza, LFolkers, GClercq, EDMarquez, VE Synthesis and biological evaluation of 5-substituted derivatives of the potent antiherpes agent (north)-methanocarbathymine. J Med Chem 46:5045-54 (2003)  
Target
Name:
Thymidine kinase, cytosolic
Synonyms:
KITH_HUMAN | TK1
Type:
PROTEIN
Mol. Mass.:
25476.50
Organism:
Homo sapiens (Human)
Description:
ChEMBL_1333884
Residue:
234
  
Inhibitor
Name:
BDBM50135091
Synonyms:
1-((1R,3S,4S,6S)-4-Hydroxy-5-hydroxymethyl-bicyclo[3.1.0]hex-2-yl)-5-methyl-1H-pyrimidine-2,4-dione 1-((1S,2S,4S,5R)-4-hydroxy-5-(hydroxymethyl)bicyclo[3.1.0]hexan-2-yl)-5-methylpyrimidine-2,4(1H,3H)-dione CHEMBL146673
Type:
Small organic molecule
Emp. Form.:
C12H16N2O4
Mol. Mass.:
252.2664
SMILES:
Cc1cn([C@H]2C[C@H](O)[C@]3(CO)C[C@H]23)c(=O)[nH]c1=O
: