Target
Interstitial collagenase
Ligand
BDBM50146636
Substrate
Meas. Tech.
ChEMBL_106147 (CHEMBL718694)
Ki
70±n/a nM
Citation
 Källblad, PTodorov, NPWillems, HMAlberts, IL Receptor flexibility in the in silico screening of reagents in the S1' pocket of human collagenase. J Med Chem 47:2761-7 (2004)  
Target
Name:
Interstitial collagenase
Synonyms:
CLG MMP1 Matrix metalloproteinase-1 | Matrix metalloproteinase-1 (MMP-1)
Type:
Enzyme
Mol. Mass.:
54010.26
Organism:
Homo sapiens (Human)
Description:
P03956
Residue:
469
  
Inhibitor
Name:
BDBM50146636
Synonyms:
2-{4-[4-(4-CHLORO-PHENOXY)-BENZENESULFONYL]-TETRAHYDRO-PYRAN-4-YL}-N-HYDROXY-ACETAMIDE CHEMBL93687
Type:
Small organic molecule
Emp. Form.:
C19H20ClNO6S
Mol. Mass.:
425.883
SMILES:
ONC(=O)CC1(CCOCC1)S(=O)(=O)c1ccc(Oc2ccc(Cl)cc2)cc1
: