Target
Interstitial collagenase
Ligand
BDBM50071839
Substrate
Meas. Tech.
ChEMBL_105980 (CHEMBL713993)
IC50
22±n/a nM
Citation
 Källblad, PTodorov, NPWillems, HMAlberts, IL Receptor flexibility in the in silico screening of reagents in the S1' pocket of human collagenase. J Med Chem 47:2761-7 (2004)  
Target
Name:
Interstitial collagenase
Synonyms:
CLG MMP1 Matrix metalloproteinase-1 | Matrix metalloproteinase-1 (MMP-1)
Type:
Enzyme
Mol. Mass.:
54010.26
Organism:
Homo sapiens (Human)
Description:
P03956
Residue:
469
  
Inhibitor
Name:
BDBM50071839
Synonyms:
4-Benzoyl-1-(4-phenoxy-benzenesulfonyl)-[1,4]diazepane-2-carboxylic acid hydroxyamide CHEMBL90978
Type:
Small organic molecule
Emp. Form.:
C25H25N3O6S
Mol. Mass.:
495.548
SMILES:
ONC(=O)C1CN(CCCN1S(=O)(=O)c1ccc(Oc2ccccc2)cc1)C(=O)c1ccccc1
: