Target
Interleukin-2 receptor subunit alpha
Ligand
BDBM50147976
Substrate
Meas. Tech.
ChEMBL_89084 (CHEMBL878448)
IC50
120000±n/a nM
Citation
 Raimundo, BCOslob, JDBraisted, ACHyde, JMcDowell, RSRandal, MWaal, NDWilkinson, JYu, CHArkin, MR Integrating fragment assembly and biophysical methods in the chemical advancement of small-molecule antagonists of IL-2: an approach for inhibiting protein-protein interactions. J Med Chem 47:3111-30 (2004)  
Target
Name:
Interleukin-2 receptor subunit alpha
Synonyms:
CD_antigen=CD25 IL-2-RA IL2RA_MOUSE Il2ra p55
Type:
PROTEIN
Mol. Mass.:
30733.96
Organism:
Mus musculus
Description:
ChEMBL_89085
Residue:
268
  
Inhibitor
Name:
BDBM50147976
Synonyms:
2-(R)-Cyclohexyl-2-guanidino-N-{2-oxo-2-[4-(5-phenyl-2H-pyrazol-3-yl)-piperidin-1-yl]-ethyl}-acetamide | CHEMBL106698
Type:
Small organic molecule
Emp. Form.:
C25H35N7O2
Mol. Mass.:
465.5911
SMILES:
NC(N)=N[C@H](C1CCCCC1)C(=O)NCC(=O)N1CCC(CC1)c1cc(n[nH]1)-c1ccccc1
: