Target
Interleukin-2 receptor subunit alpha
Ligand
BDBM50147982
Substrate
Meas. Tech.
ChEMBL_89084 (CHEMBL878448)
IC50
20000±n/a nM
Citation
 Raimundo, BCOslob, JDBraisted, ACHyde, JMcDowell, RSRandal, MWaal, NDWilkinson, JYu, CHArkin, MR Integrating fragment assembly and biophysical methods in the chemical advancement of small-molecule antagonists of IL-2: an approach for inhibiting protein-protein interactions. J Med Chem 47:3111-30 (2004)  
Target
Name:
Interleukin-2 receptor subunit alpha
Synonyms:
CD_antigen=CD25 IL-2-RA IL2RA_MOUSE Il2ra p55
Type:
PROTEIN
Mol. Mass.:
30733.96
Organism:
Mus musculus
Description:
ChEMBL_89085
Residue:
268
  
Inhibitor
Name:
BDBM50147982
Synonyms:
2-Cyclohexyl-N-(2-{4-[5-(2,3-dichloro-phenyl)-2-methyl-2H-pyrazol-3-yl]-piperidin-1-yl}-2-oxo-ethyl)-2-guanidino-acetamide | CHEMBL104746
Type:
Small organic molecule
Emp. Form.:
C26H35Cl2N7O2
Mol. Mass.:
548.508
SMILES:
[#6]-n1nc(cc1-[#6]-1-[#6]-[#6]-[#7](-[#6]-[#6]-1)-[#6](=O)-[#6]-[#7]-[#6](=O)-[#6@H](\[#7]=[#6](/[#7])-[#7])-[#6]-1-[#6]-[#6]-[#6]-[#6]-[#6]-1)-c1cccc(Cl)c1Cl
: