Target
Interleukin-2 receptor subunit alpha
Ligand
BDBM50147988
Substrate
Meas. Tech.
ChEMBL_89085 (CHEMBL698595)
IC50
>2000000±n/a nM
Citation
 Raimundo, BCOslob, JDBraisted, ACHyde, JMcDowell, RSRandal, MWaal, NDWilkinson, JYu, CHArkin, MR Integrating fragment assembly and biophysical methods in the chemical advancement of small-molecule antagonists of IL-2: an approach for inhibiting protein-protein interactions. J Med Chem 47:3111-30 (2004)  
Target
Name:
Interleukin-2 receptor subunit alpha
Synonyms:
CD_antigen=CD25 IL-2-RA IL2RA_MOUSE Il2ra p55
Type:
PROTEIN
Mol. Mass.:
30733.96
Organism:
Mus musculus
Description:
ChEMBL_89085
Residue:
268
  
Inhibitor
Name:
BDBM50147988
Synonyms:
(S)-2-[2-(2-Guanidino-acetylamino)-acetylamino]-3-(4-phenylethynyl-phenyl)-propionic acid methyl ester | CHEMBL429868
Type:
Small organic molecule
Emp. Form.:
C23H25N5O4
Mol. Mass.:
435.4757
SMILES:
COC(=O)[C@H](Cc1ccc(cc1)C#Cc1ccccc1)NC(=O)CNC(=O)CNC(N)=N
: