Target
Sterol O-acyltransferase 1
Ligand
BDBM50150483
Substrate
Meas. Tech.
ChEMBL_305696 (CHEMBL874435)
IC50
53000±n/a nM
Citation
 Xu, MZLee, WSKim, MJPark, DSYu, HTian, GRJeong, TSPark, HY Acyl-CoA: cholesterol acyltransferase inhibitory activities of fatty acid amides isolated from Mylabris phalerate Pallas. Bioorg Med Chem Lett 14:4277-80 (2004)  
Target
Name:
Sterol O-acyltransferase 1
Synonyms:
ACACT ACAT Acetyl-CoA acetyltransferase, mitochondrial Acyl-CoA: cholesterol acyltransferase (ACAT) Cholesterol acyltransferase 1 SOAT1 STAT
Type:
Multi-pass membrane protein may form homo- or heterodimers.
Mol. Mass.:
64751.94
Organism:
Homo sapiens (Human)
Description:
P35610
Residue:
550
  
Inhibitor
Name:
BDBM50150483
Synonyms:
(9Z,12Z)-Octadeca-9,12-dienoic acid amide Octadeca-9,12-dienoic acid amide
Type:
Small organic molecule
Emp. Form.:
C18H33NO
Mol. Mass.:
279.4607
SMILES:
CCCCC\C=C/C\C=C/CCCCCCCC(N)=O
: