Target
Coagulation factor X
Ligand
BDBM50041216
Substrate
Meas. Tech.
ChEMBL_305554 (CHEMBL828573)
IC50
600±n/a nM
Citation
 Ueno, HKatoh, SYokota, KHoshi, JHayashi, MUchida, IAisaka, KHase, YCho, H Structure-activity relationships of potent and selective factor Xa inhibitors: benzimidazole derivatives with the side chain oriented to the prime site of factor Xa. Bioorg Med Chem Lett 14:4281-6 (2004)  
Target
Name:
Coagulation factor X
Synonyms:
Activated coagulation factor X (FXa) Coagulation factor X precursor F10 Factor X heavy chain Factor Xa Stuart-Prower factor
Type:
Enzyme
Mol. Mass.:
54726.60
Organism:
Homo sapiens (Human)
Description:
Residue:
488
  
Inhibitor
Name:
BDBM50041216
Synonyms:
2-(2-{4-[(S)-1-(1-Imino-ethyl)-pyrrolidin-3-yloxy]-phenyl}-ethyl)-benzofuran-5-carboxamidine CHEMBL536721
Type:
Small organic molecule
Emp. Form.:
C23H26N4O2
Mol. Mass.:
390.4781
SMILES:
CC(=N)N1CC[C@@H](C1)Oc1ccc(CCc2cc3cc(ccc3o2)C(N)=N)cc1
: