Target
5-hydroxytryptamine receptor 2C
Ligand
BDBM50370414
Substrate
Meas. Tech.
ChEMBL_303542 (CHEMBL839655)
Ki
112±n/a nM
Citation
 Choi, SHaggart, DToll, LCuny, GD Synthesis, receptor binding and functional studies of mesoridazine stereoisomers. Bioorg Med Chem Lett 14:4379-82 (2004)  
Target
Name:
5-hydroxytryptamine receptor 2C
Synonyms:
5-HT2C 5-hydroxytryptamine receptor 2C (5HT2c) 5ht1c Htr2c Serotonin receptor 2a and 2c (5HT2A and 5HT2C)
Type:
Enzyme
Mol. Mass.:
51935.10
Organism:
Rattus norvegicus (Rat)
Description:
P08909
Residue:
460
  
Inhibitor
Name:
BDBM50370414
Synonyms:
CHEMBL611207 | MESORIDAZINE
Type:
Small organic molecule
Emp. Form.:
C21H26N2OS2
Mol. Mass.:
386.574
SMILES:
CN1CCCC[C@@H]1CCN1c2ccccc2Sc2ccc(cc12)[S@](C)=O
: