Target
D(3) dopamine receptor
Ligand
BDBM50370414
Substrate
Meas. Tech.
ChEMBL_303417 (CHEMBL840080)
Ki
95±n/a nM
Citation
 Choi, SHaggart, DToll, LCuny, GD Synthesis, receptor binding and functional studies of mesoridazine stereoisomers. Bioorg Med Chem Lett 14:4379-82 (2004)  
Target
Name:
D(3) dopamine receptor
Synonyms:
DOPAMINE D3 DRD3_HUMAN Dopamine D3 receptor (D3) Dopamine receptor Dopamine receptor D3
Type:
Mol. Mass.:
44243.43
Organism:
Homo sapiens (Human)
Description:
Residue:
400
  
Inhibitor
Name:
BDBM50370414
Synonyms:
CHEMBL611207 | MESORIDAZINE
Type:
Small organic molecule
Emp. Form.:
C21H26N2OS2
Mol. Mass.:
386.574
SMILES:
CN1CCCC[C@@H]1CCN1c2ccccc2Sc2ccc(cc12)[S@](C)=O
: