Target
D(2) dopamine receptor
Ligand
BDBM50370414
Substrate
Meas. Tech.
ChEMBL_305403 (CHEMBL833053)
IC50
63.0±n/a nM
Citation
 Choi, SHaggart, DToll, LCuny, GD Synthesis, receptor binding and functional studies of mesoridazine stereoisomers. Bioorg Med Chem Lett 14:4379-82 (2004)  
Target
Name:
D(2) dopamine receptor
Synonyms:
D(2) dopamine receptor DOPAMINE D2 Long DRD2 Dopamine D2 receptor Dopamine D2 receptor (D2R) Dopamine2-like | d2
Type:
Cell-surface receptors
Mol. Mass.:
50647.10
Organism:
Homo sapiens (Human)
Description:
P14416
Residue:
443
  
Inhibitor
Name:
BDBM50370414
Synonyms:
CHEMBL611207 | MESORIDAZINE
Type:
Small organic molecule
Emp. Form.:
C21H26N2OS2
Mol. Mass.:
386.574
SMILES:
CN1CCCC[C@@H]1CCN1c2ccccc2Sc2ccc(cc12)[S@](C)=O
: