Target
Dipeptidyl peptidase 4
Ligand
BDBM50150853
Substrate
Meas. Tech.
ChEMBL_305942 (CHEMBL874548)
IC50
2100±n/a nM
Citation
 Ahn, JHKim, HMJung, SHKang, SKKim, KRRhee, SDYang, SDCheon, HGKim, SS Synthesis and DP-IV inhibition of cyano-pyrazoline derivatives as potent anti-diabetic agents. Bioorg Med Chem Lett 14:4461-5 (2004)  
Target
Name:
Dipeptidyl peptidase 4
Synonyms:
Bile canaliculus domain-specific membrane glycoprotein Cd26 DPP4_RAT Dipeptidyl peptidase 4 Dipeptidyl peptidase 4 60 kDa soluble form Dipeptidyl peptidase 4 soluble form Dipeptidyl peptidase IV 60 kDa soluble form Dipeptidyl peptidase IV soluble form GP110 glycoprotein | T-cell activation antigen CD26
Type:
Enzyme
Mol. Mass.:
88084.94
Organism:
Rattus norvegicus (rat)
Description:
Residue:
767
  
Inhibitor
Name:
BDBM50150853
Synonyms:
2-(2-tert-Butylamino-acetyl)-3,4-dihydro-2H-pyrazole-3-carbonitrile | CHEMBL185923
Type:
Small organic molecule
Emp. Form.:
C10H16N4O
Mol. Mass.:
208.2602
SMILES:
CC(C)(C)NCC(=O)N1N=CCC1C#N
: