Target
Hypoxanthine-guanine phosphoribosyltransferase
Ligand
BDBM25313
Substrate
Meas. Tech.
ChEMBL_302489 (CHEMBL827179)
Ki
188600±n/a nM
Citation
 Fernández, DWenck, MACraig, SPDelfino, JM The purine transferase from Trypanosoma cruzi as a potential target for bisphosphonate-based chemotherapeutic compounds. Bioorg Med Chem Lett 14:4501-4 (2004)  
Target
Name:
Hypoxanthine-guanine phosphoribosyltransferase
Synonyms:
HGPRT | HPRT_TRYBB
Type:
PROTEIN
Mol. Mass.:
23360.10
Organism:
Trypanosoma brucei brucei
Description:
ChEMBL_302489
Residue:
210
  
Inhibitor
Name:
BDBM25313
Synonyms:
(4-amino-1-hydroxy-1-phosphonobutyl)phosphonic acid CHEMBL870 | bisphosphonate, 65
Type:
Small organic molecule
Emp. Form.:
C4H13NO7P2
Mol. Mass.:
249.096
SMILES:
NCCCC(O)(P(O)(O)=O)P(O)(O)=O
: