Target
Prostaglandin F2-alpha receptor
Ligand
BDBM50150892
Substrate
Meas. Tech.
ChEMBL_302844 (CHEMBL827889)
Ki
350±n/a nM
Citation
 Selliah, RDHellberg, MRSharif, NAMcLaughlin, MAWilliams, GWScott, DAEarnest, DHaggard, KSDean, WDDelgado, PGaines, MSConrow, REKlimko, PG AL-12182, a novel 11-oxa prostaglandin analog with topical ocular hypotensive activity in the monkey. Bioorg Med Chem Lett 14:4525-8 (2004)  
Target
Name:
Prostaglandin F2-alpha receptor
Synonyms:
PF2R_BOVIN PGF2 alpha receptor ProstaglandinF2Alpha | Prostanoid FP receptor
Type:
Enzyme Catalytic Domain
Mol. Mass.:
41044.75
Organism:
BOVINE
Description:
ProstaglandinF2Alpha PTGFR BOVINE::P37289
Residue:
362
  
Inhibitor
Name:
BDBM50150892
Synonyms:
(Z)-8-{(2R,3S,4R)-4-Hydroxy-2-[(E)-(R)-3-hydroxy-4-(3-trifluoromethyl-phenoxy)-but-1-enyl]-tetrahydro-furan-3-yl}-oct-4-enoic acid | CHEMBL185559
Type:
Small organic molecule
Emp. Form.:
C23H29F3O6
Mol. Mass.:
458.468
SMILES:
O[C@@H](COc1cccc(c1)C(F)(F)F)\C=C\[C@H]1OC[C@H](O)[C@@H]1CCC\C=C/CCC(O)=O
: