Target
Prostaglandin F2-alpha receptor
Ligand
BDBM50035622
Substrate
Meas. Tech.
ChEMBL_302844 (CHEMBL827889)
Ki
129±n/a nM
Citation
 Selliah, RDHellberg, MRSharif, NAMcLaughlin, MAWilliams, GWScott, DAEarnest, DHaggard, KSDean, WDDelgado, PGaines, MSConrow, REKlimko, PG AL-12182, a novel 11-oxa prostaglandin analog with topical ocular hypotensive activity in the monkey. Bioorg Med Chem Lett 14:4525-8 (2004)  
Target
Name:
Prostaglandin F2-alpha receptor
Synonyms:
PF2R_BOVIN PGF2 alpha receptor ProstaglandinF2Alpha | Prostanoid FP receptor
Type:
Enzyme Catalytic Domain
Mol. Mass.:
41044.75
Organism:
BOVINE
Description:
ProstaglandinF2Alpha PTGFR BOVINE::P37289
Residue:
362
  
Inhibitor
Name:
BDBM50035622
Synonyms:
(5Z,13E,15S)-9alpha,11alpha,15-trihydroxyprosta-5,13-dien-1-oic acid DINOPROST l-PGF2-alpha prostaglandin F2alpha
Type:
Small organic molecule
Emp. Form.:
C20H34O5
Mol. Mass.:
354.481
SMILES:
CCCCC[C@H](O)\C=C\[C@H]1[C@H](O)C[C@H](O)[C@@H]1C\C=C/CCCC(O)=O
: