Target
Integrin alpha-5/beta-1
Ligand
BDBM50150958
Substrate
Meas. Tech.
ChEMBL_306346 (CHEMBL828165)
IC50
>1000±n/a nM
Citation
 Marugan, JJHaslow, KDCrysler, C Design, synthesis, and biochemical evaluation of novel alpha V beta 3 integrin ligands. Bioorg Med Chem Lett 14:4553-5 (2004)  
Target
Name:
Integrin alpha-5/beta-1
Synonyms:
Fibronectin receptor alpha/beta ITGA5/ITGB1
Type:
Enzyme
Mol. Mass.:
Description:
Components:
This complex has 2 components.
Component 1
Name:
Integrin alpha-5
Synonyms:
CD49 antigen-like family member E FNRA Fibronectin receptor subunit alpha ITGA5 Integrin alpha-F | VLA-5
Type:
Single-pass type I membrane protein
Mol. Mass.:
114523.00
Organism:
Homo sapiens (Human)
Description:
Residue:
1049
  
Component 2
Name:
Integrin beta-1
Synonyms:
CD_antigen=CD29 Fibronectin receptor beta GPIIA ITGB1 MDF2 | MSK12
Type:
Enzyme
Mol. Mass.:
88400.38
Organism:
Homo sapiens (Human)
Description:
P05556
Residue:
798
  
Inhibitor
Name:
BDBM50150958
Synonyms:
CHEMBL433785 | Imidazolyl O-guanidinium analogue
Type:
Small organic molecule
Emp. Form.:
C21H22Cl2N6O7S
Mol. Mass.:
573.406
SMILES:
NC(=N)NOCCOc1ccc2[nH]c(cc2c1)C(=O)NCC(NS(=O)(=O)c1cc(Cl)cc(Cl)c1)C(O)=O
: