Target
Prostaglandin E2 receptor EP3 subtype
Ligand
BDBM17638
Substrate
Meas. Tech.
ChEMBL_302497 (CHEMBL828213)
Ki
>10000±n/a nM
Citation
 Torisu, KKobayashi, KIwahashi, MEgashira, HNakai, YOkada, YNanbu, FOhuchida, SNakai, HToda, M Discovery of new chemical leads for prostaglandin D2 receptor antagonists. Bioorg Med Chem Lett 14:4557-62 (2004)  
Target
Name:
Prostaglandin E2 receptor EP3 subtype
Synonyms:
PE2R3_MOUSE Prostaglandin E2 receptor EP3 isoform alpha Prostanoid EP3 receptor Ptgerep3
Type:
G-protein coupled receptor
Mol. Mass.:
40092.50
Organism:
Mus musculus (Mouse)
Description:
Residue:
365
  
Inhibitor
Name:
BDBM17638
Synonyms:
2-{1-[(4-chlorophenyl)carbonyl]-5-methoxy-2-methyl-1H-indol-3-yl}acetic acid Indocin US11478464, Compound Indomethacin US9271961, Indomethacin | indometacin
Type:
Small organic molecule
Emp. Form.:
C19H16ClNO4
Mol. Mass.:
357.788
SMILES:
COc1ccc2n(C(=O)c3ccc(Cl)cc3)c(C)c(CC(O)=O)c2c1
: