Target
Carbonic anhydrase 1
Ligand
BDBM50153977
Substrate
Meas. Tech.
ChEMBL_302411 (CHEMBL828816)
Ki
1200±n/a nM
Citation
 Innocenti, AZimmerman, SFerry, JGScozzafava, ASupuran, CT Carbonic anhydrase inhibitors. Inhibition of the beta-class enzyme from the methanoarchaeon Methanobacterium thermoautotrophicum (Cab) with anions. Bioorg Med Chem Lett 14:4563-7 (2004)  
Target
Name:
Carbonic anhydrase 1
Synonyms:
CA-I CAB Carbonate dehydratase I Carbonic anhydrase 1 (CA I) Carbonic anhydrase 1 (Recombinant CA I) Carbonic anhydrase B Carbonic anhydrase I (CA I) Carbonic anhydrase I (CAI) Carbonic anhydrase isoenzyme I (hCA I) | hCA
Type:
Enzyme
Mol. Mass.:
28873.37
Organism:
Homo sapiens (Human)
Description:
P00915
Residue:
261
  
Inhibitor
Name:
BDBM50153977
Synonyms:
CHEMBL186537 [NNNH] hydrido-1kappaH-trinitrogen(2N--N)hydrogen trinitride(1-) triazoic acid
Type:
Small organic molecule
Emp. Form.:
HN3
Mol. Mass.:
43.028
SMILES:
N=[N+]=[N-]
: